Reaction Details
TargetMu-type opioid receptor
LigandBDBM50185795
Substrate/Competitorn/a
Meas. Tech.ChEMBL_372753 (CHEMBL871097)
Ki 880±n/a nM
Citation Bignan, GCBattista, KConnolly, PJOrsini, MJLiu, JMiddleton, SAReitz, AB 3-(4-Piperidinyl)indoles and 3-(4-piperidinyl)pyrrolo-[2,3-b]pyridines as ligands for the ORL-1 receptor. Bioorg Med Chem Lett16:3524-8 (2006) 
 
Mu-type opioid receptor
Name:Mu-type opioid receptor
Type:G Protein-Coupled Receptor (GPCR)
Mol. Mass.:44789.51
Organism:Homo sapiens (Human)
Description:P35372
Residue:400
BDBM50185795
NameBDBM50185795
Synonyms:5-chloro-2-methyl-3-(1-(naphthalen-1-ylmethyl)piperidin-4-yl)-1H-indole | CHEMBL438965
TypeSmall organic molecule
Emp. Form.C25H25ClN2
Mol. Mass.388.932
SMILESCc1[nH]c2ccc(Cl)cc2c1C1CCN(Cc2cccc3ccccc23)CC1