Reaction Details
TargetMu-type opioid receptor
LigandBDBM50185809
Substrate/Competitorn/a
Meas. Tech.ChEMBL_372753 (CHEMBL871097)
Ki 500±n/a nM
Citation Bignan, GCBattista, KConnolly, PJOrsini, MJLiu, JMiddleton, SAReitz, AB 3-(4-Piperidinyl)indoles and 3-(4-piperidinyl)pyrrolo-[2,3-b]pyridines as ligands for the ORL-1 receptor. Bioorg Med Chem Lett16:3524-8 (2006) 
 
Mu-type opioid receptor
Name:Mu-type opioid receptor
Type:G Protein-Coupled Receptor (GPCR)
Mol. Mass.:44789.51
Organism:Homo sapiens (Human)
Description:P35372
Residue:400
BDBM50185809
NameBDBM50185809
Synonyms:3-(1-benzyl-1,2,3,6-tetrahydropyridin-4-yl)-5-chloro-1H-indole | CHEMBL211723
TypeSmall organic molecule
Emp. Form.C20H19ClN2
Mol. Mass.322.831
SMILESClc1ccc2[nH]cc(C3=CCN(Cc4ccccc4)CC3)c2c1