Reaction Details
TargetNociceptin receptor
LigandBDBM50185808
Substrate/Competitorn/a
Meas. Tech.ChEMBL_372756 (CHEMBL871100)
Ki>5000±n/a nM
Citation Bignan, GCBattista, KConnolly, PJOrsini, MJLiu, JMiddleton, SAReitz, AB 3-(4-Piperidinyl)indoles and 3-(4-piperidinyl)pyrrolo-[2,3-b]pyridines as ligands for the ORL-1 receptor. Bioorg Med Chem Lett16:3524-8 (2006) 
 
Nociceptin receptor
Name:Nociceptin receptor
Type:G Protein-Coupled Receptor (GPCR)
Mol. Mass.:40702.87
Organism:Homo sapiens (Human)
Description:P41146
Residue:370
BDBM50185808
NameBDBM50185808
Synonyms:3-(1-(4-phenoxybenzyl)piperidin-4-yl)-1H-pyrrolo[2,3-b]pyridine | CHEMBL377033
TypeSmall organic molecule
Emp. Form.C25H25N3O
Mol. Mass.383.4855
SMILESC(N1CCC(CC1)c1c[nH]c2ncccc12)c1ccc(Oc2ccccc2)cc1