Reaction Details
TargetKappa-type opioid receptor
LigandBDBM50185791
Substrate/Competitorn/a
Meas. Tech.ChEMBL_372754 (CHEMBL871098)
Ki>5000±n/a nM
Citation Bignan, GCBattista, KConnolly, PJOrsini, MJLiu, JMiddleton, SAReitz, AB 3-(4-Piperidinyl)indoles and 3-(4-piperidinyl)pyrrolo-[2,3-b]pyridines as ligands for the ORL-1 receptor. Bioorg Med Chem Lett16:3524-8 (2006) 
 
Kappa-type opioid receptor
Name:Kappa-type opioid receptor
Type:G Protein-Coupled Receptor (GPCR)
Mol. Mass.:42648.76
Organism:Homo sapiens (Human)
Description:P41145
Residue:380
BDBM50185791
NameBDBM50185791
Synonyms:3-(1-(1,2-dihydroacenaphthylen-1-yl)-1,2,3,6-tetrahydropyridin-4-yl)-1H-indole-5-carbonitrile | CHEMBL208942
TypeSmall organic molecule
Emp. Form.C26H21N3
Mol. Mass.375.465
SMILESN#Cc1ccc2[nH]cc(C3=CCN(CC3)C3Cc4cccc5cccc3c45)c2c1