Reaction Details
TargetNociceptin receptor
LigandBDBM50185786
Substrate/Competitorn/a
Meas. Tech.ChEMBL_372756 (CHEMBL871100)
Ki 160±n/a nM
Citation Bignan, GCBattista, KConnolly, PJOrsini, MJLiu, JMiddleton, SAReitz, AB 3-(4-Piperidinyl)indoles and 3-(4-piperidinyl)pyrrolo-[2,3-b]pyridines as ligands for the ORL-1 receptor. Bioorg Med Chem Lett16:3524-8 (2006) 
 
Nociceptin receptor
Name:Nociceptin receptor
Type:G Protein-Coupled Receptor (GPCR)
Mol. Mass.:40702.87
Organism:Homo sapiens (Human)
Description:P41146
Residue:370
BDBM50185786
NameBDBM50185786
Synonyms:3-(1-(1,2-dihydroacenaphthylen-1-yl)-1,2,3,6-tetrahydropyridin-4-yl)-6-fluoro-1H-indole | CHEMBL209399
TypeSmall organic molecule
Emp. Form.C25H21FN2
Mol. Mass.368.446
SMILESFc1ccc2c(c[nH]c2c1)C1=CCN(CC1)C1Cc2cccc3cccc1c23