Reaction Details
TargetBromodomain-containing protein 3
LigandBDBM50604624
Substrate/Competitorn/a
Meas. Tech.ChEMBL_2248354 (CHEMBL5162564)
Kd 26±n/a nM
Citation Li, JZhang, CXu, HWang, CDong, RShen, HZhuang, XChen, XLi, QLu, JZhang, MWu, XLoomes, KMZhou, YZhang, YLiu, JXu, Y Structure-Based Discovery and Optimization of Furo[3,2- J Med Chem65:5760-5799 (2022) 
 
Bromodomain-containing protein 3
Name:Bromodomain-containing protein 3
Type:Protein
Mol. Mass.:79571.81
Organism:Homo sapiens (Human)
Description:Q15059
Residue:726
BDBM50604624
NameBDBM50604624
Synonyms:CHEMBL5206088
TypeSmall organic molecule
Emp. Form.C33H34FN3O4
Mol. Mass.555.6392
SMILESCc1cc(F)cc(C)c1Oc1ccc(cc1-c1cn(C)c(=O)c2cc(oc12)-c1cnc([nH]1)C1CCCC1)C(C)(C)O