Reaction Details
TargetLong-chain fatty acid transport protein 4
LigandBDBM50186032
Substrate/Competitorn/a
Meas. Tech.ChEMBL_372182 (CHEMBL870441)
IC50 650±n/a nM
Citation Blackburn, CGuan, BBrown, JCullis, CCondon, SMJenkins, TJPeluso, SYe, YGimeno, REPunreddy, SSun, YWu, HHubbard, BKaushik, VTummino, PSanchetti, PYu Sun, DDaniels, TTozzo, EBalani, SKRaman, P Identification and characterization of 4-aryl-3,4-dihydropyrimidin-2(1H)-ones as inhibitors of the fatty acid transporter FATP4. Bioorg Med Chem Lett16:3504-9 (2006) 
 
Long-chain fatty acid transport protein 4
Name:Long-chain fatty acid transport protein 4
Type:PROTEIN
Mol. Mass.:72079.54
Organism:Homo sapiens (Human)
Description:ChEMBL_372182
Residue:643
BDBM50186032
NameBDBM50186032
Synonyms:(E)-but-2-enyl 6-methyl-4-(4-nitrophenyl)-2-oxo-1,2,3,4-tetrahydropyrimidine-5-carboxylate | CHEMBL211772
TypeSmall organic molecule
Emp. Form.C16H17N3O5
Mol. Mass.331.3233
SMILESC\C=C\COC(=O)C1C(NC(=O)N=C1C)c1ccc(cc1)[N+]([O-])=O