Reaction Details
TargetCyclin-dependent kinase 2
LigandBDBM50186421
Substrate/Competitorn/a
Meas. Tech.ChEMBL_377581 (CHEMBL869293)
IC50 118±n/a nM
Citation Huang, SConnolly, PJLin, REmanuel, SMiddleton, SA Synthesis and evaluation of N-acyl sulfonamides as potential prodrugs of cyclin-dependent kinase inhibitor JNJ-7706621. Bioorg Med Chem Lett16:3639-41 (2006) 
 
Cyclin-dependent kinase 2
Name:Cyclin-dependent kinase 2
Type:Enzyme Subunit
Mol. Mass.:33938.17
Organism:Homo sapiens (Human)
Description:P24941
Residue:298
BDBM50186421
NameBDBM50186421
Synonyms:CHEMBL378420 | N-(4-(5-amino-1-(2,6-difluorobenzoyl)-1H-1,2,4-triazol-3-ylamino)phenylsulfonyl)-3-morpholinopropanamide
TypeSmall organic molecule
Emp. Form.C22H23F2N7O5S
Mol. Mass.535.524
SMILESNc1nc(Nc2ccc(cc2)S(=O)(=O)NC(=O)CCN2CCOCC2)nn1C(=O)c1c(F)cccc1F