Reaction Details
TargetCyclin-dependent kinase 2
LigandBDBM50186420
Substrate/Competitorn/a
Meas. Tech.ChEMBL_377581 (CHEMBL869293)
IC50 266±n/a nM
Citation Huang, SConnolly, PJLin, REmanuel, SMiddleton, SA Synthesis and evaluation of N-acyl sulfonamides as potential prodrugs of cyclin-dependent kinase inhibitor JNJ-7706621. Bioorg Med Chem Lett16:3639-41 (2006) 
 
Cyclin-dependent kinase 2
Name:Cyclin-dependent kinase 2
Type:Enzyme Subunit
Mol. Mass.:33938.17
Organism:Homo sapiens (Human)
Description:P24941
Residue:298
BDBM50186420
NameBDBM50186420
Synonyms:CHEMBL210765 | N-(4-(5-amino-1-(2,6-difluorobenzoyl)-1H-1,2,4-triazol-3-ylamino)phenylsulfonyl)-3-(4-methylpiperazin-1-yl)propanamide
TypeSmall organic molecule
Emp. Form.C23H26F2N8O4S
Mol. Mass.548.566
SMILESCN1CCN(CCC(=O)NS(=O)(=O)c2ccc(Nc3nc(N)n(n3)C(=O)c3c(F)cccc3F)cc2)CC1