Reaction Details
TargetCyclin-dependent kinase 1
LigandBDBM50186423
Substrate/Competitorn/a
Meas. Tech.ChEMBL_377580 (CHEMBL869289)
IC50 466±n/a nM
Citation Huang, SConnolly, PJLin, REmanuel, SMiddleton, SA Synthesis and evaluation of N-acyl sulfonamides as potential prodrugs of cyclin-dependent kinase inhibitor JNJ-7706621. Bioorg Med Chem Lett16:3639-41 (2006) 
 
Cyclin-dependent kinase 1
Name:Cyclin-dependent kinase 1
Type:Enzyme Subunit
Mol. Mass.:34101.08
Organism:Homo sapiens (Human)
Description:P06493
Residue:297
BDBM50186423
NameBDBM50186423
Synonyms:CHEMBL379193 | ethyl 4-(4-(5-amino-1-(2,6-difluorobenzoyl)-1H-1,2,4-triazol-3-ylamino)phenylsulfonamido)-4-oxobutanoate
TypeSmall organic molecule
Emp. Form.C21H20F2N6O6S
Mol. Mass.522.482
SMILESCCOC(=O)CCC(=O)NS(=O)(=O)c1ccc(Nc2nc(N)n(n2)C(=O)c2c(F)cccc2F)cc1