Reaction Details
TargetTyrosine-protein kinase ITK/TSK
LigandBDBM50186466
Substrate/Competitorn/a
Meas. Tech.ChEMBL_377329 (CHEMBL864159)
IC50 30±n/a nM
Citation Das, JFurch, JALiu, CMoquin, RVLin, JSpergel, SHMcIntyre, KWShuster, DJO'Day, KDPenhallow, BHung, CYDoweyko, AMKamath, AZhang, HMarathe, PKanner, SBLin, TADodd, JHBarrish, JCWityak, J Discovery and SAR of 2-amino-5-(thioaryl)thiazoles as potent and selective Itk inhibitors. Bioorg Med Chem Lett16:3706-12 (2006) 
 
Tyrosine-protein kinase ITK/TSK
Name:Tyrosine-protein kinase ITK/TSK
Type:Protein
Mol. Mass.:71839.20
Organism:Homo sapiens (Human)
Description:Q08881
Residue:620
BDBM50186466
NameBDBM50186466
Synonyms:1-(4-(2-hydroxy-5-(2-(pyridin-2-ylamino)thiazol-5-ylthio)benzoyl)piperazin-1-yl)ethanone | CHEMBL208542
TypeSmall organic molecule
Emp. Form.C21H21N5O3S2
Mol. Mass.455.553
SMILESCC(=O)N1CCN(CC1)C(=O)c1cc(Sc2cnc(Nc3ccccn3)s2)ccc1O