Reaction Details
TargetTyrosine-protein kinase ITK/TSK
LigandBDBM50186490
Substrate/Competitorn/a
Meas. Tech.ChEMBL_377329 (CHEMBL864159)
IC50 34200±n/a nM
Citation Das, JFurch, JALiu, CMoquin, RVLin, JSpergel, SHMcIntyre, KWShuster, DJO'Day, KDPenhallow, BHung, CYDoweyko, AMKamath, AZhang, HMarathe, PKanner, SBLin, TADodd, JHBarrish, JCWityak, J Discovery and SAR of 2-amino-5-(thioaryl)thiazoles as potent and selective Itk inhibitors. Bioorg Med Chem Lett16:3706-12 (2006) 
 
Tyrosine-protein kinase ITK/TSK
Name:Tyrosine-protein kinase ITK/TSK
Type:Protein
Mol. Mass.:71839.20
Organism:Homo sapiens (Human)
Description:Q08881
Residue:620
BDBM50186490
NameBDBM50186490
Synonyms:1-(4-(3-(2-(phenylamino)thiazol-5-ylthio)benzoyl)piperazin-1-yl)ethanone | CHEMBL211998
TypeSmall organic molecule
Emp. Form.C22H22N4O2S2
Mol. Mass.438.566
SMILESCC(=O)N1CCN(CC1)C(=O)c1cccc(Sc2cnc(Nc3ccccc3)s2)c1