Reaction Details
TargetTyrosine-protein kinase ITK/TSK
LigandBDBM50182833
Substrate/Competitorn/a
Meas. Tech.ChEMBL_377329 (CHEMBL864159)
IC50 96±n/a nM
Citation Das, JFurch, JALiu, CMoquin, RVLin, JSpergel, SHMcIntyre, KWShuster, DJO'Day, KDPenhallow, BHung, CYDoweyko, AMKamath, AZhang, HMarathe, PKanner, SBLin, TADodd, JHBarrish, JCWityak, J Discovery and SAR of 2-amino-5-(thioaryl)thiazoles as potent and selective Itk inhibitors. Bioorg Med Chem Lett16:3706-12 (2006) 
 
Tyrosine-protein kinase ITK/TSK
Name:Tyrosine-protein kinase ITK/TSK
Type:Protein
Mol. Mass.:71839.20
Organism:Homo sapiens (Human)
Description:Q08881
Residue:620
BDBM50182833
NameBDBM50182833
Synonyms:CHEMBL382362 | N-(5-(3-(1-acetylpiperazine-4-carbonyl)-4,5-dimethylbenzylthio)thiazol-2-yl)-4-((3,3-dimethylbutan-2-ylamino)methyl)benzamide
TypeSmall organic molecule
Emp. Form.C33H43N5O3S2
Mol. Mass.621.856
SMILESCC(NCc1ccc(cc1)C(=O)Nc1ncc(SCc2cc(C)c(C)c(c2)C(=O)N2CCN(CC2)C(C)=O)s1)C(C)(C)C