Reaction Details
TargetSphingosine 1-phosphate receptor 1
LigandBDBM50186931
Substrate/Competitorn/a
Meas. Tech.ChEMBL_376406 (CHEMBL866632)
EC50 0.10±n/a nM
Citation Yan, LHuo, PDoherty, GToth, LHale, JJMills, SGHajdu, RKeohane, CARosenbach, MJMilligan, JAShei, GJChrebet, GBergstrom, JCard, DQuackenbush, EWickham, AMandala, SM Discovery of 3-arylpropionic acids as potent agonists of sphingosine-1-phosphate receptor-1 (S1P1) with high selectivity against all other known S1P receptor subtypes. Bioorg Med Chem Lett16:3679-83 (2006) 
 
Sphingosine 1-phosphate receptor 1
Name:Sphingosine 1-phosphate receptor 1
Type:Enzyme
Mol. Mass.:42836.02
Organism:Homo sapiens (Human)
Description:P21453
Residue:382
BDBM50186931
NameBDBM50186931
Synonyms:3-(4-(5-(5-chloro-6-(1,1,1-trifluoropropan-2-yloxy)pyridin-3-yl)-1,2,4-oxadiazol-3-yl)-3-methylphenyl)propanoic acid | CHEMBL209484
TypeSmall organic molecule
Emp. Form.C20H17ClF3N3O4
Mol. Mass.455.815
SMILESCC(Oc1ncc(cc1Cl)-c1nc(no1)-c1ccc(CCC(O)=O)cc1C)C(F)(F)F