Reaction Details
TargetSphingosine 1-phosphate receptor 1
LigandBDBM50186935
Substrate/Competitorn/a
Meas. Tech.ChEMBL_376406 (CHEMBL866632)
EC50 830±n/a nM
Citation Yan, LHuo, PDoherty, GToth, LHale, JJMills, SGHajdu, RKeohane, CARosenbach, MJMilligan, JAShei, GJChrebet, GBergstrom, JCard, DQuackenbush, EWickham, AMandala, SM Discovery of 3-arylpropionic acids as potent agonists of sphingosine-1-phosphate receptor-1 (S1P1) with high selectivity against all other known S1P receptor subtypes. Bioorg Med Chem Lett16:3679-83 (2006) 
 
Sphingosine 1-phosphate receptor 1
Name:Sphingosine 1-phosphate receptor 1
Type:Enzyme
Mol. Mass.:42836.02
Organism:Homo sapiens (Human)
Description:P21453
Residue:382
BDBM50186935
NameBDBM50186935
Synonyms:2-(4-(5-(4-cyclohexylphenyl)-1,2,4-oxadiazol-3-yl)-3-methylphenyl)acetic acid | CHEMBL425058
TypeSmall organic molecule
Emp. Form.C23H24N2O3
Mol. Mass.376.4483
SMILESCc1cc(CC(O)=O)ccc1-c1noc(n1)-c1ccc(cc1)C1CCCCC1