Reaction Details
TargetSphingosine 1-phosphate receptor 2
LigandBDBM50186928
Substrate/Competitorn/a
Meas. Tech.ChEMBL_376407 (CHEMBL866633)
EC50>10000±n/a nM
Citation Yan, LHuo, PDoherty, GToth, LHale, JJMills, SGHajdu, RKeohane, CARosenbach, MJMilligan, JAShei, GJChrebet, GBergstrom, JCard, DQuackenbush, EWickham, AMandala, SM Discovery of 3-arylpropionic acids as potent agonists of sphingosine-1-phosphate receptor-1 (S1P1) with high selectivity against all other known S1P receptor subtypes. Bioorg Med Chem Lett16:3679-83 (2006) 
 
Sphingosine 1-phosphate receptor 2
Name:Sphingosine 1-phosphate receptor 2
Type:G Protein-Coupled Receptor (GPCR)
Mol. Mass.:38883.16
Organism:Homo sapiens (Human)
Description:Membranes isolated from S1P2-transfected CHO cells were used in ligand binding assay.
Residue:353
BDBM50186928
NameBDBM50186928
Synonyms:6-(4-(5-(4-cyclohexylphenyl)-1,2,4-oxadiazol-3-yl)-3-methylphenyl)hexanoic acid | CHEMBL209008
TypeSmall organic molecule
Emp. Form.C27H32N2O3
Mol. Mass.432.5546
SMILESCc1cc(CCCCCC(O)=O)ccc1-c1noc(n1)-c1ccc(cc1)C1CCCCC1