Reaction Details
TargetSphingosine 1-phosphate receptor 5
LigandBDBM50186923
Substrate/Competitorn/a
Meas. Tech.ChEMBL_376410 (CHEMBL866638)
EC50 2600±n/a nM
Citation Yan, LHuo, PDoherty, GToth, LHale, JJMills, SGHajdu, RKeohane, CARosenbach, MJMilligan, JAShei, GJChrebet, GBergstrom, JCard, DQuackenbush, EWickham, AMandala, SM Discovery of 3-arylpropionic acids as potent agonists of sphingosine-1-phosphate receptor-1 (S1P1) with high selectivity against all other known S1P receptor subtypes. Bioorg Med Chem Lett16:3679-83 (2006) 
 
Sphingosine 1-phosphate receptor 5
Name:Sphingosine 1-phosphate receptor 5
Type:G Protein-Coupled Receptor (GPCR)
Mol. Mass.:41796.42
Organism:Homo sapiens (Human)
Description:n/a
Residue:398
BDBM50186923
NameBDBM50186923
Synonyms:3-(4-(5-(4-methoxy-3-(trifluoromethyl)phenyl)-1,2,4-oxadiazol-3-yl)-3-methylphenyl)propanoic acid | CHEMBL211806
TypeSmall organic molecule
Emp. Form.C20H17F3N2O4
Mol. Mass.406.3552
SMILESCOc1ccc(cc1C(F)(F)F)-c1nc(no1)-c1ccc(CCC(O)=O)cc1C