Reaction Details
TargetSphingosine 1-phosphate receptor 4
LigandBDBM22222
Substrate/Competitorn/a
Meas. Tech.ChEMBL_376409 (CHEMBL866637)
EC50>10000±n/a nM
Citation Yan, LHuo, PDoherty, GToth, LHale, JJMills, SGHajdu, RKeohane, CARosenbach, MJMilligan, JAShei, GJChrebet, GBergstrom, JCard, DQuackenbush, EWickham, AMandala, SM Discovery of 3-arylpropionic acids as potent agonists of sphingosine-1-phosphate receptor-1 (S1P1) with high selectivity against all other known S1P receptor subtypes. Bioorg Med Chem Lett16:3679-83 (2006) 
 
Sphingosine 1-phosphate receptor 4
Name:Sphingosine 1-phosphate receptor 4
Type:G Protein-Coupled Receptor (GPCR)
Mol. Mass.:41647.39
Organism:Homo sapiens (Human)
Description:n/a
Residue:384
BDBM22222
NameBDBM22222
Synonyms:3-(3-methyl-4-{5-[4-(propan-2-yloxy)-3-(trifluoromethyl)phenyl]-1,2,4-oxadiazol-3-yl}phenyl)propanoic acid CHEMBL208924
TypeSmall organic molecule
Emp. Form.C22H21F3N2O4
Mol. Mass.434.4083
SMILESCC(C)Oc1ccc(cc1C(F)(F)F)-c1nc(no1)-c1ccc(CCC(O)=O)cc1C