Reaction Details
TargetSphingosine 1-phosphate receptor 3
LigandBDBM50186918
Substrate/Competitorn/a
Meas. Tech.ChEMBL_376408 (CHEMBL866636)
EC50 470±n/a nM
Citation Yan, LHuo, PDoherty, GToth, LHale, JJMills, SGHajdu, RKeohane, CARosenbach, MJMilligan, JAShei, GJChrebet, GBergstrom, JCard, DQuackenbush, EWickham, AMandala, SM Discovery of 3-arylpropionic acids as potent agonists of sphingosine-1-phosphate receptor-1 (S1P1) with high selectivity against all other known S1P receptor subtypes. Bioorg Med Chem Lett16:3679-83 (2006) 
 
Sphingosine 1-phosphate receptor 3
Name:Sphingosine 1-phosphate receptor 3
Type:G Protein-Coupled Receptor (GPCR)
Mol. Mass.:42278.13
Organism:Homo sapiens (Human)
Description:Q99500
Residue:378
BDBM50186918
NameBDBM50186918
Synonyms:3-(4-(5-(4-(S)-sec-butoxy-3-cyanophenyl)-1,2,4-oxadiazol-3-yl)-3-methylphenyl)propanoic acid | CHEMBL378054
TypeSmall organic molecule
Emp. Form.C23H23N3O4
Mol. Mass.405.4464
SMILESCC[C@H](C)Oc1ccc(cc1C#N)-c1nc(no1)-c1ccc(CCC(O)=O)cc1C