Reaction Details
TargetSphingosine 1-phosphate receptor 1
LigandBDBM50186937
Substrate/Competitorn/a
Meas. Tech.ChEMBL_376411 (CHEMBL868516)
IC50 0.60±n/a nM
Citation Yan, LHuo, PDoherty, GToth, LHale, JJMills, SGHajdu, RKeohane, CARosenbach, MJMilligan, JAShei, GJChrebet, GBergstrom, JCard, DQuackenbush, EWickham, AMandala, SM Discovery of 3-arylpropionic acids as potent agonists of sphingosine-1-phosphate receptor-1 (S1P1) with high selectivity against all other known S1P receptor subtypes. Bioorg Med Chem Lett16:3679-83 (2006) 
 
Sphingosine 1-phosphate receptor 1
Name:Sphingosine 1-phosphate receptor 1
Type:Enzyme
Mol. Mass.:42836.02
Organism:Homo sapiens (Human)
Description:P21453
Residue:382
BDBM50186937
NameBDBM50186937
Synonyms:1-(4-((5-(4-isobutylphenyl)-1,2,4-oxadiazol-3-yl)methoxy)benzyl)azetidine-3-carboxylic acid | CHEMBL425428
TypeSmall organic molecule
Emp. Form.C24H27N3O4
Mol. Mass.421.4889
SMILESCC(C)Cc1ccc(cc1)-c1nc(COc2ccc(CN3CC(C3)C(O)=O)cc2)no1