Reaction Details
TargetN-formyl peptide receptor 2
LigandBDBM50186948
Substrate/Competitorn/a
Meas. Tech.ChEMBL_376306 (CHEMBL867962)
EC50 2730±n/a nM
Citation Bürli, RWXu, HZou, XMuller, KGolden, JFrohn, MAdlam, MPlant, MHWong, MMcElvain, MRegal, KViswanadhan, VNTagari, PHungate, R Potent hFPRL1 (ALXR) agonists as potential anti-inflammatory agents. Bioorg Med Chem Lett16:3713-8 (2006) 
 
N-formyl peptide receptor 2
Name:N-formyl peptide receptor 2
Type:G Protein-Coupled Receptor (GPCR)
Mol. Mass.:38968.35
Organism:Homo sapiens (Human)
Description:P25090
Residue:351
BDBM50186948
NameBDBM50186948
Synonyms:1-(2,3-dimethyl-5-oxo-1-phenyl-2,5-dihydro-1H-pyrazol-4-yl)-3-(4-methoxyphenyl)urea | CHEMBL377642
TypeSmall organic molecule
Emp. Form.C19H20N4O3
Mol. Mass.352.3871
SMILESCOc1ccc(NC(=O)Nc2c(C)n(C)n(-c3ccccc3)c2=O)cc1