Reaction Details
TargetN-formyl peptide receptor 2
LigandBDBM50186952
Substrate/Competitorn/a
Meas. Tech.ChEMBL_376306 (CHEMBL867962)
EC50 30±n/a nM
Citation Bürli, RWXu, HZou, XMuller, KGolden, JFrohn, MAdlam, MPlant, MHWong, MMcElvain, MRegal, KViswanadhan, VNTagari, PHungate, R Potent hFPRL1 (ALXR) agonists as potential anti-inflammatory agents. Bioorg Med Chem Lett16:3713-8 (2006) 
 
N-formyl peptide receptor 2
Name:N-formyl peptide receptor 2
Type:G Protein-Coupled Receptor (GPCR)
Mol. Mass.:38968.35
Organism:Homo sapiens (Human)
Description:P25090
Residue:351
BDBM50186952
NameBDBM50186952
Synonyms:1-(2,3-dimethyl-5-oxo-1-phenyl-2,5-dihydro-1H-pyrazol-4-yl)-3-(4-iodophenyl)urea | CHEMBL208884
TypeSmall organic molecule
Emp. Form.C18H17IN4O2
Mol. Mass.448.2577
SMILESCc1c(NC(=O)Nc2ccc(I)cc2)c(=O)n(-c2ccccc2)n1C