Reaction Details
TargetC-X-C chemokine receptor type 2
LigandBDBM50187002
Substrate/Competitorn/a
Meas. Tech.ChEMBL_384848 (CHEMBL867334)
IC50 3±n/a nM
Citation Merritt, JRRokosz, LLNelson, KHKaiser, BWang, WStauffer, TMOzgur, LESchilling, ALi, GBaldwin, JJTaveras, AGDwyer, MPChao, J Synthesis and structure-activity relationships of 3,4-diaminocyclobut-3-ene-1,2-dione CXCR2 antagonists. Bioorg Med Chem Lett16:4107-10 (2006) 
 
C-X-C chemokine receptor type 2
Name:C-X-C chemokine receptor type 2
Type:Protein
Mol. Mass.:40767.88
Organism:Homo sapiens (Human)
Description:P25025
Residue:360
BDBM50187002
NameBDBM50187002
Synonyms:4-(3,4-dioxo-2-(phenylamino)cyclobut-1-enylamino)-3-hydroxybenzonitrile | CHEMBL209859
TypeSmall organic molecule
Emp. Form.C17H11N3O3
Mol. Mass.305.2875
SMILESOc1cc(ccc1Nc1c(Nc2ccccc2)c(=O)c1=O)C#N