Reaction Details
TargetC-X-C chemokine receptor type 2
LigandBDBM50187012
Substrate/Competitorn/a
Meas. Tech.ChEMBL_384848 (CHEMBL867334)
IC50 139±n/a nM
Citation Merritt, JRRokosz, LLNelson, KHKaiser, BWang, WStauffer, TMOzgur, LESchilling, ALi, GBaldwin, JJTaveras, AGDwyer, MPChao, J Synthesis and structure-activity relationships of 3,4-diaminocyclobut-3-ene-1,2-dione CXCR2 antagonists. Bioorg Med Chem Lett16:4107-10 (2006) 
 
C-X-C chemokine receptor type 2
Name:C-X-C chemokine receptor type 2
Type:Protein
Mol. Mass.:40767.88
Organism:Homo sapiens (Human)
Description:P25025
Residue:360
BDBM50187012
NameBDBM50187012
Synonyms:CHEMBL436940 | N-benzyl-3-(3,4-dioxo-2-(phenylamino)cyclobut-1-enylamino)-2-hydroxybenzamide
TypeSmall organic molecule
Emp. Form.C24H19N3O4
Mol. Mass.413.4254
SMILESOc1c(Nc2c(Nc3ccccc3)c(=O)c2=O)cccc1C(=O)NCc1ccccc1