Reaction Details
TargetC-X-C chemokine receptor type 2
LigandBDBM50187015
Substrate/Competitorn/a
Meas. Tech.ChEMBL_384848 (CHEMBL867334)
IC50 10±n/a nM
Citation Merritt, JRRokosz, LLNelson, KHKaiser, BWang, WStauffer, TMOzgur, LESchilling, ALi, GBaldwin, JJTaveras, AGDwyer, MPChao, J Synthesis and structure-activity relationships of 3,4-diaminocyclobut-3-ene-1,2-dione CXCR2 antagonists. Bioorg Med Chem Lett16:4107-10 (2006) 
 
C-X-C chemokine receptor type 2
Name:C-X-C chemokine receptor type 2
Type:Protein
Mol. Mass.:40767.88
Organism:Homo sapiens (Human)
Description:P25025
Residue:360
BDBM50187015
NameBDBM50187015
Synonyms:3-(2-(cyclohexylamino)-3,4-dioxocyclobut-1-enylamino)-2-hydroxy-N,N-dimethylbenzamide | CHEMBL213130
TypeSmall organic molecule
Emp. Form.C19H23N3O4
Mol. Mass.357.4036
SMILESCN(C)C(=O)c1cccc(Nc2c(NC3CCCCC3)c(=O)c2=O)c1O