Reaction Details
TargetC-X-C chemokine receptor type 2
LigandBDBM50187021
Substrate/Competitorn/a
Meas. Tech.ChEMBL_384848 (CHEMBL867334)
IC50 926±n/a nM
Citation Merritt, JRRokosz, LLNelson, KHKaiser, BWang, WStauffer, TMOzgur, LESchilling, ALi, GBaldwin, JJTaveras, AGDwyer, MPChao, J Synthesis and structure-activity relationships of 3,4-diaminocyclobut-3-ene-1,2-dione CXCR2 antagonists. Bioorg Med Chem Lett16:4107-10 (2006) 
 
C-X-C chemokine receptor type 2
Name:C-X-C chemokine receptor type 2
Type:Protein
Mol. Mass.:40767.88
Organism:Homo sapiens (Human)
Description:P25025
Residue:360
BDBM50187021
NameBDBM50187021
Synonyms:3-(3,4-dioxo-2-(phenethylamino)cyclobut-1-enylamino)-2-hydroxy-N,N-dimethylbenzamide | CHEMBL211353
TypeSmall organic molecule
Emp. Form.C21H21N3O4
Mol. Mass.379.4091
SMILESCN(C)C(=O)c1cccc(Nc2c(NCCc3ccccc3)c(=O)c2=O)c1O