Reaction Details
TargetRNA-directed RNA polymerase
LigandBDBM50187233
Substrate/Competitorn/a
Meas. Tech.ChEMBL_356302 (CHEMBL869357)
IC50 1400±n/a nM
Citation Gopalsamy, AChopra, RLim, KCiszewski, GShi, MCurran, KJSukits, SFSvenson, KBard, JEllingboe, JWAgarwal, AKrishnamurthy, GHowe, AYOrlowski, MFeld, BO'Connell, JMansour, TS Discovery of proline sulfonamides as potent and selective hepatitis C virus NS5b polymerase inhibitors. Evidence for a new NS5b polymerase binding site. J Med Chem49:3052-5 (2006) 
 
RNA-directed RNA polymerase
Name:RNA-directed RNA polymerase
Type:Protein
Mol. Mass.:25173.95
Organism:Hepatitis C virus
Description:Q8JXU8
Residue:229
BDBM50187233
NameBDBM50187233
Synonyms:(2S)-1-[(3,5-dichloro-2-hydroxyphenyl)sulfonyl]pyrrolidine-2-carbonitrile | CHEMBL426503
TypeSmall organic molecule
Emp. Form.C11H10Cl2N2O3S
Mol. Mass.321.18
SMILESOc1c(Cl)cc(Cl)cc1S(=O)(=O)N1CCC[C@H]1C#N