Reaction Details
TargetRNA-directed RNA polymerase
LigandBDBM50187222
Substrate/Competitorn/a
Meas. Tech.ChEMBL_356302 (CHEMBL869357)
IC50 2100±n/a nM
Citation Gopalsamy, AChopra, RLim, KCiszewski, GShi, MCurran, KJSukits, SFSvenson, KBard, JEllingboe, JWAgarwal, AKrishnamurthy, GHowe, AYOrlowski, MFeld, BO'Connell, JMansour, TS Discovery of proline sulfonamides as potent and selective hepatitis C virus NS5b polymerase inhibitors. Evidence for a new NS5b polymerase binding site. J Med Chem49:3052-5 (2006) 
 
RNA-directed RNA polymerase
Name:RNA-directed RNA polymerase
Type:Protein
Mol. Mass.:25173.95
Organism:Hepatitis C virus
Description:Q8JXU8
Residue:229
BDBM50187222
NameBDBM50187222
Synonyms:(S)-1-(3-chloro-5-fluoro-2-hydroxyphenylsulfonyl)pyrrolidine-2-carboxylic acid | CHEMBL207500
TypeSmall organic molecule
Emp. Form.C11H11ClFNO5S
Mol. Mass.323.725
SMILESOC(=O)[C@@H]1CCCN1S(=O)(=O)c1cc(F)cc(Cl)c1O