Reaction Details
TargetRNA-directed RNA polymerase
LigandBDBM50187225
Substrate/Competitorn/a
Meas. Tech.ChEMBL_356302 (CHEMBL869357)
IC50 3100±n/a nM
Citation Gopalsamy, AChopra, RLim, KCiszewski, GShi, MCurran, KJSukits, SFSvenson, KBard, JEllingboe, JWAgarwal, AKrishnamurthy, GHowe, AYOrlowski, MFeld, BO'Connell, JMansour, TS Discovery of proline sulfonamides as potent and selective hepatitis C virus NS5b polymerase inhibitors. Evidence for a new NS5b polymerase binding site. J Med Chem49:3052-5 (2006) 
 
RNA-directed RNA polymerase
Name:RNA-directed RNA polymerase
Type:Protein
Mol. Mass.:25173.95
Organism:Hepatitis C virus
Description:Q8JXU8
Residue:229
BDBM50187225
NameBDBM50187225
Synonyms:(S)-1-(2-amino-4-chloro-5-methylphenylsulfonyl)pyrrolidine-2-carboxylic acid CHEMBL210593
TypeSmall organic molecule
Emp. Form.C12H15ClN2O4S
Mol. Mass.318.777
SMILESCc1cc(c(N)cc1Cl)S(=O)(=O)N1CCC[C@H]1C(O)=O