Reaction Details
TargetCytochrome P450 2D6
LigandBDBM50187673
Substrate/Competitorn/a
Meas. Tech.ChEMBL_361242 (CHEMBL854274)
IC50>30000±n/a nM
Citation Li, HAnderes, KLKraynov, EALuthin, DRDo, QQHong, YTompkins, ESun, ETRajapakse, RPathak, VPChristie, LCFeng, JVazir, HCastillo, RGregory, MLCastro, MNared-Hood, KPaderes, GAnderson, MB Discovery of a novel, orally active, small molecule gonadotropin-releasing hormone (GnRH) receptor antagonist. J Med Chem49:3362-7 (2006) 
 
Cytochrome P450 2D6
Name:Cytochrome P450 2D6
Type:Protein
Mol. Mass.:55774.82
Organism:Homo sapiens (Human)
Description:P10635
Residue:497
BDBM50187673
NameBDBM50187673
Synonyms:5-(3,3,6-trimethyl-indan-5-yloxy)-furan-2-carboxylic Acid [4,6-dimethoxy-2-(3-morpholin-4-yl-propylamino)-pyrimidine-5-yl]-amide | CHEMBL210514
TypeSmall organic molecule
Emp. Form.C30H39N5O6
Mol. Mass.565.6606
SMILESCOc1nc(NCCCN2CCOCC2)nc(OC)c1NC(=O)c1ccc(Oc2cc3c(CCC3(C)C)cc2C)o1