Reaction Details
TargetIntegrase
LigandBDBM23402
Substrate/Competitorn/a
Meas. Tech.ChEMBL_378064 (CHEMBL869770)
IC50 50±n/a nM
Citation Jin, HCai, RZSchacherer, LJabri, STsiang, MFardis, MChen, XChen, JMKim, CU Design, synthesis, and SAR studies of novel and highly active tri-cyclic HIV integrase inhibitors. Bioorg Med Chem Lett16:3989-92 (2006) 
 
Integrase
Name:Integrase
Synonyms:Human immunodeficiency virus type 1 integrase
Type:PROTEIN
Mol. Mass.:32231.48
Organism:Human immunodeficiency virus 1
Description:ChEMBL_90865
Residue:288
BDBM23402
NameBDBM23402
TypeSmall organic molecule
Emp. Form.C20H19FN4O4S
Mol. Mass.430.453
SMILESOc1c(nc(N2CCCCS2(=O)=O)c2cccnc12)C(=O)NCc1ccc(F)cc1