Reaction Details
TargetDual specificity mitogen-activated protein kinase kinase 1
LigandBDBM50187818
Substrate/Competitorn/a
Meas. Tech.ChEMBL_383093 (CHEMBL867341)
IC50 44±n/a nM
Citation Varaprasad, CVBarawkar, DEl Abdellaoui, HChakravarty, SAllan, MChen, HZhang, WWu, JZTam, RHamatake, RLang, SHong, Z Discovery of 3-hydroxy-4-carboxyalkylamidino-5-arylamino-isothiazoles as potent MEK1 inhibitors. Bioorg Med Chem Lett16:3975-80 (2006) 
 
Dual specificity mitogen-activated protein kinase kinase 1
Name:Dual specificity mitogen-activated protein kinase kinase 1
Type:Other Protein Type
Mol. Mass.:43439.03
Organism:Homo sapiens (Human)
Description:Full-length human MEK-1 was generated by PCR and purified as a fusion protein from Escherichia coli lysates.
Residue:393
BDBM50187818
NameBDBM50187818
Synonyms:5-(2-chloro-4-iodophenylamino)-3-hydroxy-N-(1-hydroxypropan-2-yl)isothiazole-4-carboxamidine | CHEMBL213167
TypeSmall organic molecule
Emp. Form.C13H14ClIN4O2S
Mol. Mass.452.698
SMILESCC(CO)NC(=N)c1c(Nc2ccc(I)cc2Cl)s[nH]c1=O