Reaction Details
TargetPeroxisome proliferator-activated receptor delta
LigandBDBM28661
Substrate/Competitorn/a
Meas. Tech.ChEMBL_380766 (CHEMBL867359)
EC50 3±n/a nM
Citation Epple, RRusso, RAzimioara, MCow, CXie, YWang, XWityak, JKaranewsky, DGerken, AIskandar, MSaez, EMartin Seidel, HTian, SS 3,4,5-Trisubstituted isoxazoles as novel PPARdelta agonists: Part 1. Bioorg Med Chem Lett16:4376-80 (2006) 
 
Peroxisome proliferator-activated receptor delta
Name:Peroxisome proliferator-activated receptor delta
Type:Enzyme
Mol. Mass.:49910.45
Organism:Homo sapiens (Human)
Description:Q03181
Residue:441
BDBM28661
NameBDBM28661
Synonyms:2-{2-methyl-4-[({4-methyl-2-[4-(trifluoromethyl)phenyl]-1,3-thiazol-5-yl}methyl)sulfanyl]phenoxy}acetic acid GW 501516 GW1516 | GW501516
TypeSmall organic molecule
Emp. Form.C21H18F3NO3S2
Mol. Mass.453.498
SMILESCc1nc(sc1CSc1ccc(OCC(O)=O)c(C)c1)-c1ccc(cc1)C(F)(F)F