Reaction Details
TargetTyrosine-protein kinase Lck
LigandBDBM50188343
Substrate/Competitorn/a
Meas. Tech.ChEMBL_389337 (CHEMBL868650)
IC50 2±n/a nM
Citation Sabat, MVanrens, JCBrugel, TAMaier, JLaufersweiler, MJGolebiowski, ADe, BEaswaran, VHsieh, LCRosegen, JBerberich, SSuchanek, EJanusz, MJ The development of novel 1,2-dihydro-pyrimido[4,5-c]pyridazine based inhibitors of lymphocyte specific kinase (Lck). Bioorg Med Chem Lett16:4257-61 (2006) 
 
Tyrosine-protein kinase Lck
Name:Tyrosine-protein kinase Lck
Type:n/a
Mol. Mass.:57987.83
Organism:Homo sapiens (Human)
Description:P06239
Residue:509
BDBM50188343
NameBDBM50188343
Synonyms:4-(2,6-dichloro-phenyl)-8-[4-(2-diethylamino-ethoxy)-phenylamino]-1,2-dihydro-3a,7,9,9b-tetraaza-cyclopenta[a]naphthalen-3-one | CHEMBL379517
TypeSmall organic molecule
Emp. Form.C27H28Cl2N6O2
Mol. Mass.539.456
SMILESCCN(CC)CCOc1ccc(Nc2ncc3C=C(N4N(CCC4=O)c3n2)c2c(Cl)cccc2Cl)cc1