Reaction Details
TargetMu-type opioid receptor
LigandBDBM50188803
Substrate/Competitorn/a
Meas. Tech.ChEMBL_378751 (CHEMBL871496)
IC50 3920±n/a nM
Citation Alberati, DHainzl, DJolidon, SKrafft, EAKurt, AMaier, APinard, EThomas, AWZimmerli, D Discovery of 4-substituted-8-(2-hydroxy-2-phenyl-cyclohexyl)-2,8-diaza-spiro[4.5]decan-1-one as a novel class of highly selective GlyT1 inhibitors with improved metabolic stability. Bioorg Med Chem Lett16:4311-5 (2006) 
 
Mu-type opioid receptor
Name:Mu-type opioid receptor
Type:G Protein-Coupled Receptor (GPCR)
Mol. Mass.:44789.51
Organism:Homo sapiens (Human)
Description:P35372
Residue:400
BDBM50188803
NameBDBM50188803
Synonyms:(S)-4-phenyl-8-((1R,2R)-2-phenyl-cyclohexyl)-2,8-diaza-spiro[4.5]decan-1-one | CHEMBL379860
TypeSmall organic molecule
Emp. Form.C26H32N2O
Mol. Mass.388.5451
SMILESO=C1NC[C@@H](c2ccccc2)C11CCN(CC1)[C@@H]1CCCC[C@@H]1c1ccccc1