Reaction Details
TargetPotassium voltage-gated channel subfamily H member 2
LigandBDBM50188364
Substrate/Competitorn/a
Meas. Tech.ChEMBL_378763 (CHEMBL854582)
IC50 1800±n/a nM
Citation Alberati, DHainzl, DJolidon, SKrafft, EAKurt, AMaier, APinard, EThomas, AWZimmerli, D Discovery of 4-substituted-8-(2-hydroxy-2-phenyl-cyclohexyl)-2,8-diaza-spiro[4.5]decan-1-one as a novel class of highly selective GlyT1 inhibitors with improved metabolic stability. Bioorg Med Chem Lett16:4311-5 (2006) 
 
Potassium voltage-gated channel subfamily H member 2
Name:Potassium voltage-gated channel subfamily H member 2
Type:Multi-pass membrane protein
Mol. Mass.:126672.65
Organism:Homo sapiens (Human)
Description:Q12809
Residue:1159
BDBM50188364
NameBDBM50188364
Synonyms:8-[2-(4-fluoro-phenyl)-2-hydroxy-cyclohexyl]-4-phenyl-2,8-diaza-spiro[4.5]decan-1-one | CHEMBL214122
TypeSmall organic molecule
Emp. Form.C26H31FN2O2
Mol. Mass.422.5349
SMILESOC1(CCCCC1N1CCC2(CC1)C(CNC2=O)c1ccccc1)c1ccc(F)cc1