Reaction Details
TargetMu-type opioid receptor
LigandBDBM50188374
Substrate/Competitorn/a
Meas. Tech.ChEMBL_378751 (CHEMBL871496)
IC50 150±n/a nM
Citation Alberati, DHainzl, DJolidon, SKrafft, EAKurt, AMaier, APinard, EThomas, AWZimmerli, D Discovery of 4-substituted-8-(2-hydroxy-2-phenyl-cyclohexyl)-2,8-diaza-spiro[4.5]decan-1-one as a novel class of highly selective GlyT1 inhibitors with improved metabolic stability. Bioorg Med Chem Lett16:4311-5 (2006) 
 
Mu-type opioid receptor
Name:Mu-type opioid receptor
Type:G Protein-Coupled Receptor (GPCR)
Mol. Mass.:44789.51
Organism:Homo sapiens (Human)
Description:P35372
Residue:400
BDBM50188374
NameBDBM50188374
Synonyms:1-phenyl-8-(2-phenyl-cyclohexyl)-1,3,8-triaza-spiro[4.5]decan-4-one | CHEMBL377140
TypeSmall organic molecule
Emp. Form.C25H31N3O
Mol. Mass.389.5331
SMILESO=C1NCN(c2ccccc2)C11CCN(CC1)C1CCCCC1c1ccccc1