Reaction Details
TargetMu-type opioid receptor
LigandBDBM50188376
Substrate/Competitorn/a
Meas. Tech.ChEMBL_378751 (CHEMBL871496)
IC50 2700±n/a nM
Citation Alberati, DHainzl, DJolidon, SKrafft, EAKurt, AMaier, APinard, EThomas, AWZimmerli, D Discovery of 4-substituted-8-(2-hydroxy-2-phenyl-cyclohexyl)-2,8-diaza-spiro[4.5]decan-1-one as a novel class of highly selective GlyT1 inhibitors with improved metabolic stability. Bioorg Med Chem Lett16:4311-5 (2006) 
 
Mu-type opioid receptor
Name:Mu-type opioid receptor
Type:G Protein-Coupled Receptor (GPCR)
Mol. Mass.:44789.51
Organism:Homo sapiens (Human)
Description:P35372
Residue:400
BDBM50188376
NameBDBM50188376
Synonyms:8-(2-hydroxy-2-phenyl-cyclohexyl)-1-phenyl-1,3,8-triaza-spiro[4.5]decan-4-one | CHEMBL211373
TypeSmall organic molecule
Emp. Form.C25H31N3O2
Mol. Mass.405.5325
SMILESOC1(CCCCC1N1CCC2(CC1)N(CNC2=O)c1ccccc1)c1ccccc1