Reaction Details
Target72 kDa type IV collagenase
LigandBDBM50606378
Substrate/Competitorn/a
Meas. Tech.ChEMBL_2254619 (CHEMBL5168829)
IC50 0.089000±n/a nM
Citation Takeuchi, THayashi, MTamita, TNomura, YKojima, NMitani, ATakeda, THitaka, KKato, YKamitani, MMima, MToki, HOhkubo, MNozoe, AKakinuma, H Discovery of Aryloxyphenyl-Heptapeptide Hybrids as Potent and Selective Matrix Metalloproteinase-2 Inhibitors for the Treatment of Idiopathic Pulmonary Fibrosis. J Med Chem65:8493-8510 (2022) 
 
72 kDa type IV collagenase
Name:72 kDa type IV collagenase
Type:Enzyme
Mol. Mass.:73870.36
Organism:Homo sapiens (Human)
Description: P08253
Residue:660
BDBM50606378
NameBDBM50606378
Synonyms:CHEMBL5170274
TypeSmall organic molecule
Emp. Form.C44H62N8O13S2
Mol. Mass.975.139
SMILESCSCC[C@H](NC(=O)[C@H](CC(C)C)NC(=O)[C@H](C)NC(=O)[C@H](CC(O)=O)NC(=O)[C@H](CC(N)=O)NC(=O)CCCCS(=O)(=O)c1ccc(Oc2ccccc2)cc1)C(=O)N1CCC[C@H]1C(N)=O