Reaction Details
TargetHistamine H1 receptor
LigandBDBM112780
Substrate/Competitorn/a
Meas. Tech.ChEMBL_2254812 (CHEMBL5169022)
Ki 0.177828±n/a nM
Citation Kok, ZYStoddart, LAMistry, SJMocking, TAMVischer, HFLeurs, RHill, SJMistry, SNKellam, B Optimization of Peptide Linker-Based Fluorescent Ligands for the Histamine H J Med Chem65:8258-8288 (2022) 
 
Histamine H1 receptor
Name:Histamine H1 receptor
Type:G Protein-Coupled Receptor (GPCR)
Mol. Mass.:55808.72
Organism:Homo sapiens (Human)
Description:Cell pellets from SK-N-MC cells transfected with human H1 receptor were used in binding assay.
Residue:487
BDBM112780
NameBDBM112780
Synonyms:US8629135, SW-07
TypeSmall organic molecule
Emp. Form.C19H21NO
Mol. Mass.279.3761
SMILESCN(C)CC\C=C1/c2ccccc2COc2ccccc12