Reaction Details
TargetMelanocortin receptor 4
LigandBDBM50189008
Substrate/Competitorn/a
Meas. Tech.ChEMBL_395996 (CHEMBL910341)
Ki 11±n/a nM
Citation Tian, XMishra, RKSwitzer, AGHu, XEKim, NMazur, AWEbetino, FHWos, JACrossdoersen, DPinney, BBFarmer, JASheldon, RJ Design and synthesis of potent and selective 1,3,4-trisubstituted-2-oxopiperazine based melanocortin-4 receptor agonists. Bioorg Med Chem Lett16:4668-73 (2006) 
 
Melanocortin receptor 4
Name:Melanocortin receptor 4
Type:Enzyme
Mol. Mass.:36949.50
Organism:Homo sapiens (Human)
Description:P32245
Residue:332
BDBM50189008
NameBDBM50189008
Synonyms:(S)-2-((S)-4-((R)-2-amino-3-(4-fluorophenyl)propanoyl)-3-(2-guanidinoethyl)-2-oxopiperazin-1-yl)-N-methyl-3-(naphthalen-2-yl)propanamide CHEMBL213566
TypeSmall organic molecule
Emp. Form.C30H36FN7O3
Mol. Mass.561.6503
SMILES[#6]-[#7]-[#6](=O)-[#6@H](-[#6]-c1ccc2ccccc2c1)-[#7]-1-[#6]-[#6]-[#7](-[#6@@H](-[#6]-[#6]\[#7]=[#6](\[#7])-[#7])-[#6]-1=O)-[#6](=O)-[#6@H](-[#7])-[#6]-c1ccc(F)cc1