Reaction Details
TargetMelanin-concentrating hormone receptor 1
LigandBDBM50189581
Substrate/Competitorn/a
Meas. Tech.ChEMBL_368881 (CHEMBL865555)
Ki 1.2±n/a nM
Citation Dyck, BMarkison, SZhao, LTamiya, JGrey, JRowbottom, MWZhang, MVickers, TSorensen, KNorton, CWen, JHeise, CESaunders, JConlon, PMadan, ASchwarz, DGoodfellow, VS A thienopyridazinone-based melanin-concentrating hormone receptor 1 antagonist with potent in vivo anorectic properties. J Med Chem49:3753-6 (2006) 
 
Melanin-concentrating hormone receptor 1
Name:Melanin-concentrating hormone receptor 1
Type:Enzyme Catalytic Domain
Mol. Mass.:39075.64
Organism:RAT
Description:Melanin Concentrating Hormone 1 GPR24 RAT::P97639
Residue:353
BDBM50189581
NameBDBM50189581
Synonyms:(S)-6-(4-chlorophenyl)-2-(6-(3-(methylamino)pyrrolidin-1-yl)pyridin-3-yl)phthalazin-1(2H)-one | CHEMBL210191
TypeSmall organic molecule
Emp. Form.C24H22ClN5O
Mol. Mass.431.917
SMILESCN[C@H]1CCN(C1)c1ccc(cn1)-n1ncc2cc(ccc2c1=O)-c1ccc(Cl)cc1