Reaction Details
TargetMelanin-concentrating hormone receptor 1
LigandBDBM50189591
Substrate/Competitorn/a
Meas. Tech.ChEMBL_368881 (CHEMBL865555)
Ki 2.6±n/a nM
Citation Dyck, BMarkison, SZhao, LTamiya, JGrey, JRowbottom, MWZhang, MVickers, TSorensen, KNorton, CWen, JHeise, CESaunders, JConlon, PMadan, ASchwarz, DGoodfellow, VS A thienopyridazinone-based melanin-concentrating hormone receptor 1 antagonist with potent in vivo anorectic properties. J Med Chem49:3753-6 (2006) 
 
Melanin-concentrating hormone receptor 1
Name:Melanin-concentrating hormone receptor 1
Type:Enzyme Catalytic Domain
Mol. Mass.:39075.64
Organism:RAT
Description:Melanin Concentrating Hormone 1 GPR24 RAT::P97639
Residue:353
BDBM50189591
NameBDBM50189591
Synonyms:(R)-2-(4-ethylphenyl)-6-(6-(3-(methylamino)pyrrolidin-1-yl)pyridin-3-yl)thieno[2,3-d]pyridazin-7(6H)-one | CHEMBL211340
TypeSmall organic molecule
Emp. Form.C24H25N5OS
Mol. Mass.431.553
SMILESCCc1ccc(cc1)-c1cc2cnn(-c3ccc(nc3)N3CC[C@H](C3)NC)c(=O)c2s1