Reaction Details
TargetD(1A) dopamine receptor
LigandBDBM50190051
Substrate/Competitorn/a
Meas. Tech.ChEMBL_393313 (CHEMBL911523)
Ki 51±n/a nM
Citation Su, JTang, HMcKittrick, BABurnett, DAZhang, HSmith-Torhan, AFawzi, ALachowicz, J Modification of the clozapine structure by parallel synthesis. Bioorg Med Chem Lett16:4548-53 (2006) 
 
D(1A) dopamine receptor
Name:D(1A) dopamine receptor
Type:Enzyme
Mol. Mass.:49303.43
Organism:Homo sapiens (Human)
Description:P21728
Residue:446
BDBM50190051
NameBDBM50190051
Synonyms:4-cyano-N-[2,8-dichloro-11-(4-methyl-piperazin-1-yl)-dibenzo[b,e][1,4]diazepin-5-yl]-benzamide | CHEMBL378648
TypeSmall organic molecule
Emp. Form.C26H22Cl2N6O
Mol. Mass.505.398
SMILESCN1CCN(CC1)C1=Nc2cc(Cl)ccc2N(NC(=O)c2ccc(cc2)C#N)c2ccc(Cl)cc12