Reaction Details
TargetD(1A) dopamine receptor
LigandBDBM50190053
Substrate/Competitorn/a
Meas. Tech.ChEMBL_393313 (CHEMBL911523)
Ki 54±n/a nM
Citation Su, JTang, HMcKittrick, BABurnett, DAZhang, HSmith-Torhan, AFawzi, ALachowicz, J Modification of the clozapine structure by parallel synthesis. Bioorg Med Chem Lett16:4548-53 (2006) 
 
D(1A) dopamine receptor
Name:D(1A) dopamine receptor
Type:Enzyme
Mol. Mass.:49303.43
Organism:Homo sapiens (Human)
Description:P21728
Residue:446
BDBM50190053
NameBDBM50190053
Synonyms:2-chloro-N-[8-chloro-11-(4-ethyl-piperazin-1-yl)-dibenzo[b,e][1,4]diazepin-5-yl]-benzamide | CHEMBL215842
TypeSmall organic molecule
Emp. Form.C26H25Cl2N5O
Mol. Mass.494.416
SMILESCCN1CCN(CC1)C1=Nc2cc(Cl)ccc2N(NC(=O)c2ccccc2Cl)c2ccccc12