Reaction Details
TargetD(1A) dopamine receptor
LigandBDBM50190073
Substrate/Competitorn/a
Meas. Tech.ChEMBL_393313 (CHEMBL911523)
Ki 16±n/a nM
Citation Su, JTang, HMcKittrick, BABurnett, DAZhang, HSmith-Torhan, AFawzi, ALachowicz, J Modification of the clozapine structure by parallel synthesis. Bioorg Med Chem Lett16:4548-53 (2006) 
 
D(1A) dopamine receptor
Name:D(1A) dopamine receptor
Type:Enzyme
Mol. Mass.:49303.43
Organism:Homo sapiens (Human)
Description:P21728
Residue:446
BDBM50190073
NameBDBM50190073
Synonyms:CHEMBL384269 | N-[8-chloro-11-(4-methyl-piperazin-1-yl)-dibenzo[b,e][1,4]diazepin-5-yl]-2,3-difluoro-benzamide
TypeSmall organic molecule
Emp. Form.C25H22ClF2N5O
Mol. Mass.481.925
SMILESCN1CCN(CC1)C1=Nc2cc(Cl)ccc2N(NC(=O)c2cccc(F)c2F)c2ccccc12