Reaction Details
TargetD(1A) dopamine receptor
LigandBDBM50190087
Substrate/Competitorn/a
Meas. Tech.ChEMBL_393313 (CHEMBL911523)
Ki 3106±n/a nM
Citation Su, JTang, HMcKittrick, BABurnett, DAZhang, HSmith-Torhan, AFawzi, ALachowicz, J Modification of the clozapine structure by parallel synthesis. Bioorg Med Chem Lett16:4548-53 (2006) 
 
D(1A) dopamine receptor
Name:D(1A) dopamine receptor
Type:Enzyme
Mol. Mass.:49303.43
Organism:Homo sapiens (Human)
Description:P21728
Residue:446
BDBM50190087
NameBDBM50190087
Synonyms:8-chloro-11-[4-(2,2-difluoro-benzo[1,3]dioxol-4-ylmethyl)-piperazin-1-yl]-5H-dibenzo[b,e][1,4]diazepine | CHEMBL384634
TypeSmall organic molecule
Emp. Form.C25H21ClF2N4O2
Mol. Mass.482.91
SMILESFC1(F)Oc2cccc(CN3CCN(CC3)C3=Nc4cc(Cl)ccc4Nc4ccccc34)c2O1