Reaction Details
TargetD(2) dopamine receptor
LigandBDBM50190091
Substrate/Competitorn/a
Meas. Tech.ChEMBL_393314 (CHEMBL911524)
Ki 69±n/a nM
Citation Su, JTang, HMcKittrick, BABurnett, DAZhang, HSmith-Torhan, AFawzi, ALachowicz, J Modification of the clozapine structure by parallel synthesis. Bioorg Med Chem Lett16:4548-53 (2006) 
 
D(2) dopamine receptor
Name:D(2) dopamine receptor
Type:Cell-surface receptors
Mol. Mass.:50647.10
Organism:Homo sapiens (Human)
Description:P14416
Residue:443
BDBM50190091
NameBDBM50190091
Synonyms:CHEMBL378341 | N-[2,8-dichloro-11-(4-methyl-piperazin-1-yl)-dibenzo[b,e][1,4]diazepin-5-yl]-5-fluoro-2-trifluoromethyl-benzamide
TypeSmall organic molecule
Emp. Form.C26H21Cl2F4N5O
Mol. Mass.566.377
SMILESCN1CCN(CC1)C1=Nc2cc(Cl)ccc2N(NC(=O)c2cc(F)ccc2C(F)(F)F)c2ccc(Cl)cc12