Reaction Details
TargetD(2) dopamine receptor
LigandBDBM50190062
Substrate/Competitorn/a
Meas. Tech.ChEMBL_393314 (CHEMBL911524)
Ki 287±n/a nM
Citation Su, JTang, HMcKittrick, BABurnett, DAZhang, HSmith-Torhan, AFawzi, ALachowicz, J Modification of the clozapine structure by parallel synthesis. Bioorg Med Chem Lett16:4548-53 (2006) 
 
D(2) dopamine receptor
Name:D(2) dopamine receptor
Type:Cell-surface receptors
Mol. Mass.:50647.10
Organism:Homo sapiens (Human)
Description:P14416
Residue:443
BDBM50190062
NameBDBM50190062
Synonyms:CHEMBL213336 | N-[8-chloro-11-(4-methyl-piperazin-1-yl)-dibenzo[b,e][1,4]diazepin-5-yl]-2,6-dimethyl-benzamide
TypeSmall organic molecule
Emp. Form.C27H28ClN5O
Mol. Mass.473.997
SMILESCN1CCN(CC1)C1=Nc2cc(Cl)ccc2N(NC(=O)c2c(C)cccc2C)c2ccccc12