Reaction Details
TargetD(1A) dopamine receptor
LigandBDBM50190054
Substrate/Competitorn/a
Meas. Tech.ChEMBL_393313 (CHEMBL911523)
Ki 56±n/a nM
Citation Su, JTang, HMcKittrick, BABurnett, DAZhang, HSmith-Torhan, AFawzi, ALachowicz, J Modification of the clozapine structure by parallel synthesis. Bioorg Med Chem Lett16:4548-53 (2006) 
 
D(1A) dopamine receptor
Name:D(1A) dopamine receptor
Type:Enzyme
Mol. Mass.:49303.43
Organism:Homo sapiens (Human)
Description:P21728
Residue:446
BDBM50190054
NameBDBM50190054
Synonyms:CHEMBL213668 | benzo[1,3]dioxole-5-carboxylic acid [8-chloro-11-(4-methyl-piperazin-1-yl)-dibenzo[b,e][1,4]diazepin-5-yl]-amide
TypeSmall organic molecule
Emp. Form.C26H24ClN5O3
Mol. Mass.489.953
SMILESCN1CCN(CC1)C1=Nc2cc(Cl)ccc2N(NC(=O)c2ccc3OCOc3c2)c2ccccc12